{"text_format":"1","workbook":"xlsx","n_sheets":9,"sheets":["Rank of top medaling nations"," rank of top economies","GDP-2016","Top 12 Medaling 2016 GDP-Adj","Top 12 Medaling 2012 GDP-Adj","Unadjusted-2012","Overall Score-2012","Major Economic Powers-2012","GDP-2012"],"not_rendered":{"charts":3,"images":186,"macros":0,"external_links":0,"defined_names":0,"comments":0,"pivot_tables":0},"unopened":[],"bounds":{"document_bytes":16777216,"sheet_cells":100000,"rows_first":2000,"rows_last":500,"rows_between":2000,"halvings":0,"cell_chars":16384,"cell_head_chars":4096},"cells_cut":0,"cells_raw":0,"read":"whole","date_system":"1900"}

{"sheet":"Rank of top medaling nations","index":0,"n_rows":91,"n_cols":12,"rows_kept":91,"cut":false,"hidden":false,"merged":[]}
[]
[null,null,3,2,1]
[null,null,"Gold","Silver","Bronze ","Points","Match GDP","GDP ($M)","GDP $T","Pts/$T GDP"]
[1,"United States",46,37,38,{"$f":"SUMPRODUCT(C4:E4,$C$2:$E$2)","v":250},{"$f":"MATCH(B4,  'GDP-2016'!$C$3:$C$197,0)","v":1},{"$f":"OFFSET('GDP-2016'!$D$2,G4,0)","v":17946996},{"$f":"H4/1000/1000","v":17.946995999999999},{"$f":"F4/I4","v":13.929907824128341}]
[2,"Great Britain",27,23,17,{"$f":"SUMPRODUCT(C5:E5,$C$2:$E$2)","v":144},{"$f":"MATCH(B5,  'GDP-2016'!$C$3:$C$197,0)","v":5},{"$f":"OFFSET('GDP-2016'!$D$2,G5,0)","v":2848755},{"$f":"H5/1000/1000","v":2.8487550000000001},{"$f":"F5/I5","v":50.548397457836842}]
[3,"China",26,18,26,{"$f":"SUMPRODUCT(C6:E6,$C$2:$E$2)","v":140},{"$f":"MATCH(B6,  'GDP-2016'!$C$3:$C$197,0)","v":2},{"$f":"OFFSET('GDP-2016'!$D$2,G6,0)","v":10866444},10.866444,12.883699580101826]
[4,"Russia",19,18,19,{"$f":"SUMPRODUCT(C7:E7,$C$2:$E$2)","v":112},{"$f":"MATCH(B7,  'GDP-2016'!$C$3:$C$197,0)","v":13},{"$f":"OFFSET('GDP-2016'!$D$2,G7,0)","v":1326015},1.3260150000000002,84.463599582206825]
[5,"Germany",17,10,15,{"$f":"SUMPRODUCT(C8:E8,$C$2:$E$2)","v":86},{"$f":"MATCH(B8,  'GDP-2016'!$C$3:$C$197,0)","v":4},{"$f":"OFFSET('GDP-2016'!$D$2,G8,0)","v":3355772},3.355772,25.62748601514048]
[6,"Japan",12,8,21,{"$f":"SUMPRODUCT(C9:E9,$C$2:$E$2)","v":73},{"$f":"MATCH(B9,  'GDP-2016'!$C$3:$C$197,0)","v":3},{"$f":"OFFSET('GDP-2016'!$D$2,G9,0)","v":4123258},4.1232579999999999,17.704446338308202]
[7,"France",10,18,14,{"$f":"SUMPRODUCT(C10:E10,$C$2:$E$2)","v":80},{"$f":"MATCH(B10,  'GDP-2016'!$C$3:$C$197,0)","v":6},{"$f":"OFFSET('GDP-2016'!$D$2,G10,0)","v":2421682},2.4216819999999997,33.034890625606508]
[8,"South Korea",9,3,9,{"$f":"SUMPRODUCT(C11:E11,$C$2:$E$2)","v":42},{"$f":"MATCH(B11,  'GDP-2016'!$C$3:$C$197,0)","v":11},{"$f":"OFFSET('GDP-2016'!$D$2,G11,0)","v":1377873},1.3778730000000001,30.481764284516785]
[9,"Italy",8,12,8,{"$f":"SUMPRODUCT(C12:E12,$C$2:$E$2)","v":56},{"$f":"MATCH(B12,  'GDP-2016'!$C$3:$C$197,0)","v":8},{"$f":"OFFSET('GDP-2016'!$D$2,G12,0)","v":1814763},1.8147629999999999,30.85802388521256]
[10,"Australia",8,11,10,{"$f":"SUMPRODUCT(C13:E13,$C$2:$E$2)","v":56},{"$f":"MATCH(B13,  'GDP-2016'!$C$3:$C$197,0)","v":12},{"$f":"OFFSET('GDP-2016'!$D$2,G13,0)","v":1339539},1.339539,41.805427090961892]
[11,"Netherlands",8,7,4,{"$f":"SUMPRODUCT(C14:E14,$C$2:$E$2)","v":42},{"$f":"MATCH(B14,  'GDP-2016'!$C$3:$C$197,0)","v":17},{"$f":"OFFSET('GDP-2016'!$D$2,G14,0)","v":752547},0.75254700000000008,55.810467651854296]
[12,"Hungary",8,3,4,{"$f":"SUMPRODUCT(C15:E15,$C$2:$E$2)","v":34},{"$f":"MATCH(B15,  'GDP-2016'!$C$3:$C$197,0)","v":57},{"$f":"OFFSET('GDP-2016'!$D$2,G15,0)","v":120687},0.120687,281.72048356492411]
{"$rows_left_out":77}
{"sheet":" rank of top economies","index":1,"n_rows":90,"n_cols":12,"rows_kept":90,"cut":false,"hidden":false,"merged":[]}
[]
[null,null,3,2,1]
[null,null,"Gold","Silver","Bronze ","Points","Match GDP","GDP ($M)","GDP $T","Pts/$T GDP"]
[1,"United States",46,37,38,{"$f":"SUMPRODUCT(C4:E4,$C$2:$E$2)","v":250},{"$f":"MATCH(B4,  'GDP-2016'!$C$3:$C$197,0)","v":1},{"$f":"OFFSET('GDP-2016'!$D$2,G4,0)","v":17946996},{"$f":"H4/1000/1000","v":17.946995999999999},{"$f":"F4/I4","v":13.929907824128341}]
[3,"China",26,18,26,{"$f":"SUMPRODUCT(C5:E5,$C$2:$E$2)","v":140},{"$f":"MATCH(B5,  'GDP-2016'!$C$3:$C$197,0)","v":2},{"$f":"OFFSET('GDP-2016'!$D$2,G5,0)","v":10866444},{"$f":"H5/1000/1000","v":10.866444},{"$f":"F5/I5","v":12.883699580101826}]
[6,"Japan",12,8,21,{"$f":"SUMPRODUCT(C6:E6,$C$2:$E$2)","v":73},{"$f":"MATCH(B6,  'GDP-2016'!$C$3:$C$197,0)","v":3},{"$f":"OFFSET('GDP-2016'!$D$2,G6,0)","v":4123258},{"$f":"H6/1000/1000","v":4.1232579999999999},{"$f":"F6/I6","v":17.704446338308202}]
[5,"Germany",17,10,15,{"$f":"SUMPRODUCT(C7:E7,$C$2:$E$2)","v":86},{"$f":"MATCH(B7,  'GDP-2016'!$C$3:$C$197,0)","v":4},{"$f":"OFFSET('GDP-2016'!$D$2,G7,0)","v":3355772},{"$f":"H7/1000/1000","v":3.355772},{"$f":"F7/I7","v":25.62748601514048}]
[2,"Great Britain",27,23,17,{"$f":"SUMPRODUCT(C8:E8,$C$2:$E$2)","v":144},{"$f":"MATCH(B8,  'GDP-2016'!$C$3:$C$197,0)","v":5},{"$f":"OFFSET('GDP-2016'!$D$2,G8,0)","v":2848755},{"$f":"H8/1000/1000","v":2.8487550000000001},{"$f":"F8/I8","v":50.548397457836842}]
[7,"France",10,18,14,{"$f":"SUMPRODUCT(C9:E9,$C$2:$E$2)","v":80},{"$f":"MATCH(B9,  'GDP-2016'!$C$3:$C$197,0)","v":6},{"$f":"OFFSET('GDP-2016'!$D$2,G9,0)","v":2421682},{"$f":"H9/1000/1000","v":2.4216819999999997},{"$f":"F9/I9","v":33.034890625606508}]
[67,"India",0,1,1,{"$f":"SUMPRODUCT(C10:E10,$C$2:$E$2)","v":3},{"$f":"MATCH(B10,  'GDP-2016'!$C$3:$C$197,0)","v":7},{"$f":"OFFSET('GDP-2016'!$D$2,G10,0)","v":2073543},{"$f":"H10/1000/1000","v":2.0735429999999999},{"$f":"F10/I10","v":1.4467990294872111}]
[9,"Italy",8,12,8,{"$f":"SUMPRODUCT(C11:E11,$C$2:$E$2)","v":56},{"$f":"MATCH(B11,  'GDP-2016'!$C$3:$C$197,0)","v":8},{"$f":"OFFSET('GDP-2016'!$D$2,G11,0)","v":1814763},{"$f":"H11/1000/1000","v":1.8147629999999999},{"$f":"F11/I11","v":30.85802388521256}]
[13,"Brazil",7,6,6,{"$f":"SUMPRODUCT(C12:E12,$C$2:$E$2)","v":39},{"$f":"MATCH(B12,  'GDP-2016'!$C$3:$C$197,0)","v":9},{"$f":"OFFSET('GDP-2016'!$D$2,G12,0)","v":1774725},{"$f":"H12/1000/1000","v":1.7747249999999999},{"$f":"F12/I12","v":21.975235599881675}]
[20,"Canada",4,3,15,{"$f":"SUMPRODUCT(C13:E13,$C$2:$E$2)","v":33},{"$f":"MATCH(B13,  'GDP-2016'!$C$3:$C$197,0)","v":10},{"$f":"OFFSET('GDP-2016'!$D$2,G13,0)","v":1550537},{"$f":"H13/1000/1000","v":1.5505370000000001},{"$f":"F13/I13","v":21.282949068613004}]
[8,"South Korea",9,3,9,{"$f":"SUMPRODUCT(C14:E14,$C$2:$E$2)","v":42},{"$f":"MATCH(B14,  'GDP-2016'!$C$3:$C$197,0)","v":11},{"$f":"OFFSET('GDP-2016'!$D$2,G14,0)","v":1377873},{"$f":"H14/1000/1000","v":1.3778730000000001},{"$f":"F14/I14","v":30.481764284516785}]
[10,"Australia",8,11,10,{"$f":"SUMPRODUCT(C15:E15,$C$2:$E$2)","v":56},{"$f":"MATCH(B15,  'GDP-2016'!$C$3:$C$197,0)","v":12},{"$f":"OFFSET('GDP-2016'!$D$2,G15,0)","v":1339539},{"$f":"H15/1000/1000","v":1.339539},{"$f":"F15/I15","v":41.805427090961892}]
{"$rows_left_out":76}
{"sheet":"GDP-2016","index":2,"n_rows":198,"n_cols":7,"rows_kept":198,"cut":false,"hidden":false,"merged":[]}
["https://en.wikipedia.org/wiki/List_of_countries_by_GDP_(nominal)"]
["World Bank 2015 numbers",null,null,"$M","$B"]
[null,1,"United States",17946996,{"$f":"D3/1000","v":17946.995999999999}]
[null,2,"China",10866444,{"$f":"D4/1000","v":10866.444}]
[null,3,"Japan",4123258,4123.2579999999998]
[null,4,"Germany",3355772,3355.7719999999999]
[null,5,"Great Britain",2848755,2848.7550000000001," United Kingdom"]
[null,6,"France",2421682,2421.6819999999998]
[null,7,"India",2073543,2073.5430000000001]
[null,8,"Italy",1814763,1814.7629999999999]
[null,9,"Brazil",1774725,1774.7249999999999]
[null,10,"Canada",1550537,1550.537]
[null,11,"South Korea",1377873,1377.873]
[null,12,"Australia",1339539,1339.539]
[null,13,"Russia",1326015,1326.0150000000001]
{"$rows_left_out":184}
{"sheet":"Top 12 Medaling 2016 GDP-Adj","index":3,"n_rows":30,"n_cols":15,"rows_kept":30,"cut":false,"hidden":false,"merged":[]}
["Olympic Medal Efficiency: Top 20 Economies Sorted by GDP-Adjusted Score",null,null,null,null,null,null,null,null,null,null,null,"2016 Games"]
[null,"Analysis by David Brode of The Brode Group"]
[]
[]
[null,null,null,null,3,2,1,null,"USD B","Pts per"]
[null,"Country",null,null,"Gold","Silver","Bronze","Points","GDP","$T GDP",null,"Visual Representation"]
[null,"Russia",null,null,19,18,19,{"$f":"SUMPRODUCT($E$5:$G$5,E7:G7)","v":112},1326.0150000000001,{"$f":"H7/(I7/1000)","v":84.463599582206825},null,{"$f":"REPT(\"|\",ROUND(J7,0))","v":"||||||||||||||||||||||||||||||||||||||||||||||||||||||||||||||||||||||||||||||||||||"}]
[null,"Netherlands",null,null,8,7,4,{"$f":"SUMPRODUCT($E$5:$G$5,E8:G8)","v":42},752.54700000000003,{"$f":"H8/(I8/1000)","v":55.810467651854296},null,{"$f":"REPT(\"|\",ROUND(J8,0))","v":"||||||||||||||||||||||||||||||||||||||||||||||||||||||||"}]
[null,"Great Britain",null,null,27,23,17,{"$f":"SUMPRODUCT($E$5:$G$5,E9:G9)","v":144},2848.7550000000001,{"$f":"H9/(I9/1000)","v":50.548397457836842},null,"|||||||||||||||||||||||||||||||||||||||||||||||||||"]
[null,"Australia",null,null,8,11,10,{"$f":"SUMPRODUCT($E$5:$G$5,E10:G10)","v":56},1339.539,{"$f":"H10/(I10/1000)","v":41.805427090961892},null,"||||||||||||||||||||||||||||||||||||||||||"]
[null,"France",null,null,10,18,14,{"$f":"SUMPRODUCT($E$5:$G$5,E11:G11)","v":80},2421.6819999999998,{"$f":"H11/(I11/1000)","v":33.034890625606508},null,"|||||||||||||||||||||||||||||||||"]
[null,"Italy",null,null,8,12,8,{"$f":"SUMPRODUCT($E$5:$G$5,E12:G12)","v":56},1814.7629999999999,{"$f":"H12/(I12/1000)","v":30.85802388521256},null,"|||||||||||||||||||||||||||||||"]
[null,"South Korea",null,null,9,3,9,{"$f":"SUMPRODUCT($E$5:$G$5,E13:G13)","v":42},1377.873,{"$f":"H13/(I13/1000)","v":30.481764284516785},null,"||||||||||||||||||||||||||||||"]
[null,"Spain",null,null,7,4,6,{"$f":"SUMPRODUCT($E$5:$G$5,E14:G14)","v":35},1199.057,{"$f":"H14/(I14/1000)","v":29.189604831129795},null,"|||||||||||||||||||||||||||||"]
[null,"Germany",null,null,17,10,15,{"$f":"SUMPRODUCT($E$5:$G$5,E15:G15)","v":86},3355.7719999999999,{"$f":"H15/(I15/1000)","v":25.62748601514048},null,"||||||||||||||||||||||||||"]
{"$rows_left_out":16}
{"sheet":"Top 12 Medaling 2012 GDP-Adj","index":4,"n_rows":29,"n_cols":15,"rows_kept":29,"cut":false,"hidden":false,"merged":[]}
["Olympic Medal Efficiency: Top 20 Economies Sorted by GDP-Adjusted Score",null,null,null,null,null,null,null,null,null,null,null,"2016 Games"]
[null,"Analysis by David Brode of The Brode Group"]
[]
[]
[null,null,null,null,3,2,1,null,"USD B","Pts per"]
[null,"Country",null,null,"Gold","Silver","Bronze","Points","GDP","$T GDP",null,"Visual Representation"]
[null,"Russia",null,null,24,26,32,{"$f":"SUMPRODUCT($E$5:$G$5,E7:G7)","v":156},1850.4010000000001,{"$f":"H7/(I7/1000)","v":84.306050418260696},null,{"$f":"REPT(\"|\",ROUND(J7,0))","v":"||||||||||||||||||||||||||||||||||||||||||||||||||||||||||||||||||||||||||||||||||||"}]
[null,"United Kingdom",null,null,29,17,19,{"$f":"SUMPRODUCT($E$5:$G$5,E8:G8)","v":140},2417.5700000000002,57.909388352767451,null,{"$f":"REPT(\"|\",ROUND(J8,0))","v":"||||||||||||||||||||||||||||||||||||||||||||||||||||||||||"}]
[null,"South Korea",null,null,13,8,7,{"$f":"SUMPRODUCT($E$5:$G$5,E9:G9)","v":62},1116.2470000000001,55.543262378308746,null,"||||||||||||||||||||||||||||||||||||||||||||||||||||||||"]
[null,"Netherlands",null,null,6,6,8,{"$f":"SUMPRODUCT($E$5:$G$5,E10:G10)","v":38},840.43299999999999,45.214788091376711,null,"|||||||||||||||||||||||||||||||||||||||||||||"]
[null,"Australia",null,null,7,16,12,{"$f":"SUMPRODUCT($E$5:$G$5,E11:G11)","v":65},1488.221,43.676308827788347,null,"||||||||||||||||||||||||||||||||||||||||||||"]
[null,"China",null,null,38,27,23,{"$f":"SUMPRODUCT($E$5:$G$5,E12:G12)","v":191},7298.1469999999999,26.171026700339141,null,"||||||||||||||||||||||||||"]
[null,"France",null,null,11,11,12,{"$f":"SUMPRODUCT($E$5:$G$5,E13:G13)","v":67},2776.3240000000001,24.132630053264673,null,"||||||||||||||||||||||||"]
[null,"Italy",null,null,8,9,11,{"$f":"SUMPRODUCT($E$5:$G$5,E14:G14)","v":53},2198.73,24.104824148485719,null,"||||||||||||||||||||||||"]
[null,"Germany",null,null,11,19,14,{"$f":"SUMPRODUCT($E$5:$G$5,E15:G15)","v":85},3577.0309999999999,23.762723890287784,null,"||||||||||||||||||||||||"]
{"$rows_left_out":15}
{"sheet":"Unadjusted-2012","index":5,"n_rows":87,"n_cols":12,"rows_kept":87,"cut":false,"hidden":false,"merged":[]}
["Olympic Medals--2012",null,null,3,2,1]
[null,null,null,"Gold","Silver","Bronze","Total","Points","Match GDP","GDP ($M)","GDP $T","Pts/$T GDP"]
[1,null,"United States",46,29,29,104,{"$f":"SUMPRODUCT(D3:F3,$D$1:$F$1)","v":225},{"$f":"MATCH(C3,  'GDP-2012'!$C$4:$C$189,0)","v":178},{"$f":"OFFSET('GDP-2012'!$D$3,I3,0)","v":15094025},{"$f":"J3/1000/1000","v":15.094025},{"$f":"H3/K3","v":14.90656070862477}]
[2,null,"China",38,27,23,88,{"$f":"SUMPRODUCT(D4:F4,$D$1:$F$1)","v":191},{"$f":"MATCH(C4,  'GDP-2012'!$C$4:$C$189,0)","v":36},{"$f":"OFFSET('GDP-2012'!$D$3,I4,0)","v":7298147},7.2981470000000002,26.171026700339141]
[3,null,"Russia",24,26,32,82,{"$f":"SUMPRODUCT(D5:F5,$D$1:$F$1)","v":156},{"$f":"MATCH(C5,  'GDP-2012'!$C$4:$C$189,0)","v":137},{"$f":"OFFSET('GDP-2012'!$D$3,I5,0)","v":1850401},1.850401,84.306050418260696]
[4,null,"United Kingdom",29,17,19,65,{"$f":"SUMPRODUCT(D6:F6,$D$1:$F$1)","v":140},{"$f":"MATCH(C6,  'GDP-2012'!$C$4:$C$189,0)","v":177},{"$f":"OFFSET('GDP-2012'!$D$3,I6,0)","v":2417570},2.41757,57.909388352767451]
[5,null,"Germany",11,19,14,44,{"$f":"SUMPRODUCT(D7:F7,$D$1:$F$1)","v":85},{"$f":"MATCH(C7,  'GDP-2012'!$C$4:$C$189,0)","v":64},{"$f":"OFFSET('GDP-2012'!$D$3,I7,0)","v":3577031},3.5770309999999998,23.762723890287784]
[6,null,"France",11,11,12,34,{"$f":"SUMPRODUCT(D8:F8,$D$1:$F$1)","v":67},{"$f":"MATCH(C8,  'GDP-2012'!$C$4:$C$189,0)","v":60},{"$f":"OFFSET('GDP-2012'!$D$3,I8,0)","v":2776324},2.7763240000000002,24.132630053264673]
[7,null,"Japan",7,14,17,38,{"$f":"SUMPRODUCT(D9:F9,$D$1:$F$1)","v":66},{"$f":"MATCH(C9,  'GDP-2012'!$C$4:$C$189,0)","v":85},{"$f":"OFFSET('GDP-2012'!$D$3,I9,0)","v":5869471},5.8694709999999999,11.244624941498135]
[8,null,"Australia",7,16,12,35,{"$f":"SUMPRODUCT(D10:F10,$D$1:$F$1)","v":65},{"$f":"MATCH(C10,  'GDP-2012'!$C$4:$C$189,0)","v":8},{"$f":"OFFSET('GDP-2012'!$D$3,I10,0)","v":1488221},1.488221,43.676308827788347]
[9,null,"South Korea",13,8,7,28,{"$f":"SUMPRODUCT(D11:F11,$D$1:$F$1)","v":62},{"$f":"MATCH(C11,  'GDP-2012'!$C$4:$C$189,0)","v":154},{"$f":"OFFSET('GDP-2012'!$D$3,I11,0)","v":1116247},1.116247,55.543262378308746]
[10,null,"Italy",8,9,11,28,{"$f":"SUMPRODUCT(D12:F12,$D$1:$F$1)","v":53},{"$f":"MATCH(C12,  'GDP-2012'!$C$4:$C$189,0)","v":83},{"$f":"OFFSET('GDP-2012'!$D$3,I12,0)","v":2198730},2.1987299999999999,24.104824148485719]
[11,null,"Netherlands",6,6,8,20,{"$f":"SUMPRODUCT(D13:F13,$D$1:$F$1)","v":38},{"$f":"MATCH(C13,  'GDP-2012'!$C$4:$C$189,0)","v":118},{"$f":"OFFSET('GDP-2012'!$D$3,I13,0)","v":840433},0.84043299999999999,45.214788091376711]
[12,null,"Hungary",8,4,5,17,{"$f":"SUMPRODUCT(D14:F14,$D$1:$F$1)","v":37},{"$f":"MATCH(C14,  'GDP-2012'!$C$4:$C$189,0)","v":75},{"$f":"OFFSET('GDP-2012'!$D$3,I14,0)","v":140303},0.14030300000000001,263.71495976565006]
[13,null,"Ukraine",6,5,9,20,{"$f":"SUMPRODUCT(D15:F15,$D$1:$F$1)","v":37},{"$f":"MATCH(C15,  'GDP-2012'!$C$4:$C$189,0)","v":175},{"$f":"OFFSET('GDP-2012'!$D$3,I15,0)","v":164960},0.16496,224.29679922405433]
{"$rows_left_out":73}
{"sheet":"Overall Score-2012","index":6,"n_rows":88,"n_cols":20,"rows_kept":88,"cut":false,"hidden":false,"merged":[]}
["Olympic Medal Efficiency Leaders",null,null,3,2,1]
[null,null,null,"Gold","Silver","Bronze","Total","Points","Match GDP","GDP ($M)","GDP $T","Pts/$T GDP",null,null,null,"Name","GDP","Pts","Pts/GDP"]
[1,null,"Grenada",1,"-","-",1,{"$f":"SUMPRODUCT(D3:F3,$D$1:$F$1)","v":3},{"$f":"MATCH(C3,  'GDP-2012'!$C$4:$C$189,0)","v":67},{"$f":"OFFSET('GDP-2012'!$D$3,I3,0)","v":822},{"$f":"J3/1000/1000","v":8.2199999999999992E-4},{"$f":"H3/K3","v":3649.6350364963505},null,"Straight efficiency.",null,{"$f":"C3","v":"Grenada"},{"$f":"K3","v":8.2199999999999992E-4},{"$f":"H3","v":3},{"$f":"R3/Q3","v":3649.6350364963505},"Overperform"]
[2,null,"Jamaica",4,4,4,12,{"$f":"SUMPRODUCT(D4:F4,$D$1:$F$1)","v":24},{"$f":"MATCH(C4,  'GDP-2012'!$C$4:$C$189,0)","v":84},{"$f":"OFFSET('GDP-2012'!$D$3,I4,0)","v":14807},1.4807000000000001E-2,1620.8550010130343,null,null,null,{"$f":"C4","v":"Jamaica"},{"$f":"K4","v":1.4807000000000001E-2},{"$f":"H4","v":24},{"$f":"R4/Q4","v":1620.8550010130343},"Overperform"]
[3,null,"Georgia",1,3,3,7,{"$f":"SUMPRODUCT(D5:F5,$D$1:$F$1)","v":12},{"$f":"MATCH(C5,  'GDP-2012'!$C$4:$C$189,0)","v":63},{"$f":"OFFSET('GDP-2012'!$D$3,I5,0)","v":14347},1.4347E-2,836.41179340628696,null,null,null,"Georgia",1.4347E-2,12,836.41179340628696,"Overperform"]
[4,null,"Mongolia","-",2,3,5,{"$f":"SUMPRODUCT(D6:F6,$D$1:$F$1)","v":7},{"$f":"MATCH(C6,  'GDP-2012'!$C$4:$C$189,0)","v":112},{"$f":"OFFSET('GDP-2012'!$D$3,I6,0)","v":8506},8.5059999999999997E-3,822.9485069362803,null,null,null,"Mongolia",8.5059999999999997E-3,7,822.9485069362803,"Overperform"]
[5,null,"Kenya",2,4,5,11,{"$f":"SUMPRODUCT(D7:F7,$D$1:$F$1)","v":19},{"$f":"MATCH(C7,  'GDP-2012'!$C$4:$C$189,0)","v":88},{"$f":"OFFSET('GDP-2012'!$D$3,I7,0)","v":34796},3.4796000000000001E-2,546.03977468674555,null,null,null,"Kenya",3.4796000000000001E-2,19,546.03977468674555,"Overperform"]
[6,null,"North Korea",4,"-",2,6,{"$f":"SUMPRODUCT(D8:F8,$D$1:$F$1)","v":14},{"$f":"MATCH(C8,  'GDP-2012'!$C$4:$C$189,0)","v":123},{"$f":"OFFSET('GDP-2012'!$D$3,I8,0)","v":28000},2.8000000000000001E-2,500,null,null,null,"North Korea",2.8000000000000001E-2,14,500,"Overperform"]
[7,null,"Ethiopia",3,1,3,7,{"$f":"SUMPRODUCT(D9:F9,$D$1:$F$1)","v":14},{"$f":"MATCH(C9,  'GDP-2012'!$C$4:$C$189,0)","v":57},{"$f":"OFFSET('GDP-2012'!$D$3,I9,0)","v":31256},3.1255999999999999E-2,447.91400051190175,null,null,null,"Ethiopia",3.1255999999999999E-2,14,447.91400051190175,"Overperform"]
[8,null,"Montenegro","-",1,"-",1,{"$f":"SUMPRODUCT(D10:F10,$D$1:$F$1)","v":2},{"$f":"MATCH(C10,  'GDP-2012'!$C$4:$C$189,0)","v":113},{"$f":"OFFSET('GDP-2012'!$D$3,I10,0)","v":4536},4.5359999999999992E-3,440.91710758377434,null,null,null,"Montenegro",4.5359999999999992E-3,2,440.91710758377434,"Overperform"]
[9,null,"Belarus",3,5,5,13,{"$f":"SUMPRODUCT(D11:F11,$D$1:$F$1)","v":24},{"$f":"MATCH(C11,  'GDP-2012'!$C$4:$C$189,0)","v":15},{"$f":"OFFSET('GDP-2012'!$D$3,I11,0)","v":55483},5.5482999999999998E-2,432.5649297983166,null,null,null,"Belarus",5.5482999999999998E-2,24,432.5649297983166,"Overperform"]
[10,null,"Cuba",5,3,6,14,{"$f":"SUMPRODUCT(D12:F12,$D$1:$F$1)","v":27},{"$f":"MATCH(C12,  'GDP-2012'!$C$4:$C$189,0)","v":44},{"$f":"OFFSET('GDP-2012'!$D$3,I12,0)","v":62705},6.2704999999999997E-2,430.58767243441514,null,null,null,"Cuba",6.2704999999999997E-2,27,430.58767243441514,"Overperform"]
[11,null,"Armenia","-",1,2,3,{"$f":"SUMPRODUCT(D13:F13,$D$1:$F$1)","v":4},{"$f":"MATCH(C13,  'GDP-2012'!$C$4:$C$189,0)","v":7},{"$f":"OFFSET('GDP-2012'!$D$3,I13,0)","v":10106},1.0106E-2,395.80447259054029,null,null,null,"Armenia",1.0106E-2,4,395.80447259054029,"Overperform"]
[12,null,"Bahamas",1,"-","-",1,{"$f":"SUMPRODUCT(D14:F14,$D$1:$F$1)","v":3},{"$f":"MATCH(C14,  'GDP-2012'!$C$4:$C$189,0)","v":11},{"$f":"OFFSET('GDP-2012'!$D$3,I14,0)","v":8074},8.0739999999999996E-3,371.56304186276941,null,null,null,"Bahamas",8.0739999999999996E-3,3,371.56304186276941,"Overperform"]
[13,null,"Moldova","-","-",2,2,{"$f":"SUMPRODUCT(D15:F15,$D$1:$F$1)","v":2},{"$f":"MATCH(C15,  'GDP-2012'!$C$4:$C$189,0)","v":111},{"$f":"OFFSET('GDP-2012'!$D$3,I15,0)","v":7003},7.0030000000000005E-3,285.59188919034699,null,null,null,"Moldova",7.0030000000000005E-3,2,285.59188919034699,"Overperform"]
{"$rows_left_out":74}
{"sheet":"Major Economic Powers-2012","index":7,"n_rows":90,"n_cols":18,"rows_kept":90,"cut":false,"hidden":false,"merged":[]}
["Olympic Medals Adjusted for GDP",null,null,3,2,1]
[null,null,null,"Gold","Silver","Bronze","Total","Points","Match GDP","GDP ($M)","GDP $T","Pts/$T GDP"]
[1,null,"Russia",24,26,32,82,{"$f":"SUMPRODUCT(D3:F3,$D$1:$F$1)","v":156},{"$f":"MATCH(C3,  'GDP-2012'!$C$4:$C$189,0)","v":137},{"$f":"OFFSET('GDP-2012'!$D$3,I3,0)","v":1850401},{"$f":"J3/1000/1000","v":1.850401},{"$f":"H3/K3","v":84.306050418260696},null,null,"Top 20 Economies",null,{"$f":"SUM(K3:K22)","v":55.918240000000004},{"$f":"Q3/Q4","v":0.84705629432775853}]
[2,null,"United Kingdom",29,17,19,65,{"$f":"SUMPRODUCT(D4:F4,$D$1:$F$1)","v":140},{"$f":"MATCH(C4,  'GDP-2012'!$C$4:$C$189,0)","v":177},{"$f":"OFFSET('GDP-2012'!$D$3,I4,0)","v":2417570},2.41757,57.909388352767451,null,null,"Total",null,{"$f":"SUM(K3:K90)","v":66.014786000000015}]
[3,null,"South Korea",13,8,7,28,{"$f":"SUMPRODUCT(D5:F5,$D$1:$F$1)","v":62},{"$f":"MATCH(C5,  'GDP-2012'!$C$4:$C$189,0)","v":154},{"$f":"OFFSET('GDP-2012'!$D$3,I5,0)","v":1116247},1.116247,55.543262378308746]
[4,null,"Netherlands",6,6,8,20,{"$f":"SUMPRODUCT(D6:F6,$D$1:$F$1)","v":38},{"$f":"MATCH(C6,  'GDP-2012'!$C$4:$C$189,0)","v":118},{"$f":"OFFSET('GDP-2012'!$D$3,I6,0)","v":840433},0.84043299999999999,45.214788091376711]
[5,null,"Australia",7,16,12,35,{"$f":"SUMPRODUCT(D7:F7,$D$1:$F$1)","v":65},{"$f":"MATCH(C7,  'GDP-2012'!$C$4:$C$189,0)","v":8},{"$f":"OFFSET('GDP-2012'!$D$3,I7,0)","v":1488221},1.488221,43.676308827788347,null,null,"Great Power medal efficiency: Russia, UK, SKorea., Neth, Aust."]
[6,null,"China",38,27,23,88,{"$f":"SUMPRODUCT(D8:F8,$D$1:$F$1)","v":191},{"$f":"MATCH(C8,  'GDP-2012'!$C$4:$C$189,0)","v":36},{"$f":"OFFSET('GDP-2012'!$D$3,I8,0)","v":7298147},7.2981470000000002,26.171026700339141]
[7,null,"France",11,11,12,34,{"$f":"SUMPRODUCT(D9:F9,$D$1:$F$1)","v":67},{"$f":"MATCH(C9,  'GDP-2012'!$C$4:$C$189,0)","v":60},{"$f":"OFFSET('GDP-2012'!$D$3,I9,0)","v":2776324},2.7763240000000002,24.132630053264673]
[8,null,"Italy",8,9,11,28,{"$f":"SUMPRODUCT(D10:F10,$D$1:$F$1)","v":53},{"$f":"MATCH(C10,  'GDP-2012'!$C$4:$C$189,0)","v":83},{"$f":"OFFSET('GDP-2012'!$D$3,I10,0)","v":2198730},2.1987299999999999,24.104824148485719]
[9,null,"Germany",11,19,14,44,{"$f":"SUMPRODUCT(D11:F11,$D$1:$F$1)","v":85},{"$f":"MATCH(C11,  'GDP-2012'!$C$4:$C$189,0)","v":64},{"$f":"OFFSET('GDP-2012'!$D$3,I11,0)","v":3577031},3.5770309999999998,23.762723890287784]
[10,null,"Spain",3,10,4,17,{"$f":"SUMPRODUCT(D12:F12,$D$1:$F$1)","v":33},{"$f":"MATCH(C12,  'GDP-2012'!$C$4:$C$189,0)","v":155},{"$f":"OFFSET('GDP-2012'!$D$3,I12,0)","v":1493513},1.4935129999999999,22.095555914143368]
[11,null,"Switzerland",2,2,"-",4,{"$f":"SUMPRODUCT(D13:F13,$D$1:$F$1)","v":10},{"$f":"MATCH(C13,  'GDP-2012'!$C$4:$C$189,0)","v":161},{"$f":"OFFSET('GDP-2012'!$D$3,I13,0)","v":636059},0.63605899999999993,15.721811970273199]
[12,null,"United States",46,29,29,104,{"$f":"SUMPRODUCT(D14:F14,$D$1:$F$1)","v":225},{"$f":"MATCH(C14,  'GDP-2012'!$C$4:$C$189,0)","v":178},{"$f":"OFFSET('GDP-2012'!$D$3,I14,0)","v":15094025},15.094025,14.90656070862477]
[13,null,"Canada",1,5,12,18,{"$f":"SUMPRODUCT(D15:F15,$D$1:$F$1)","v":25},{"$f":"MATCH(C15,  'GDP-2012'!$C$4:$C$189,0)","v":31},{"$f":"OFFSET('GDP-2012'!$D$3,I15,0)","v":1736869},1.736869,14.393716509420111]
{"$rows_left_out":76}
{"sheet":"GDP-2012","index":8,"n_rows":190,"n_cols":6,"rows_kept":190,"cut":false,"hidden":false,"merged":[]}
[]
[]
[null,null,null,null,null,"Source: Wikipedia, IMF 2011 GDP"]
[null,1,"Afghanistan",18181]
[null,2,"Albania",12847]
[null,3,"Algeria",190709]
[null,4,"Angola",100948]
[null,5,"Antigua and Barbuda",1187]
[null,6,"Argentina",447644]
[null,7,"Armenia",10106]
[null,8,"Australia",1488221]
[null,9,"Austria",419243]
[null,10,"Azerbaijan",62321]
[null,11,"Bahamas",8074]
[null,12,"Bahrain",26108]
{"$rows_left_out":175}